HomePhabricator

[Go / ASAN] Disable Go bindings for ASAN tests.

Description

[Go / ASAN] Disable Go bindings for ASAN tests.

Go binding tests fail under ASAN with the error at the bottom of this
commit message. The reason the buildbots are not currently always
failing on this test is that they selectively disable the bindings due
to a Go binary not being present on their system.

This change should allow users to build an asan-bootstrapped compiler
and run asan-ified unit tests locally, similar to the way that
sanitizer-* buildbots do.

The error is:

FAIL: LLVM :: Bindings/Go/go.test (7050 of 30112)
******************** TEST 'LLVM :: Bindings/Go/go.test' FAILED ********************
Script:
--
: 'RUN: at line 1';   /usr/local/google/home/mitchp/llvm-build/asan/sanitized-clang/bin/llvm-go go=/usr/lib/google-golang/bin/go test llvm.org/llvm/bindings/go/llvm
--
Exit Code: 1

Command Output (stdout):
--
FAIL	llvm.org/llvm/bindings/go/llvm [build failed]

--
Command Output (stderr):
--
ld.lld: error: undefined symbol: std::allocator<char>::allocator()
>>> referenced by InstrumentationBindings.cpp
>>>               $WORK/b048/_x018.o:(LLVMAddDataFlowSanitizerPass)

ld.lld: error: undefined symbol: std::__cxx11::basic_string<char, std::char_traits<char>, std::allocator<char> >::basic_string(char const*, std::allocator<char> const&)
>>> referenced by InstrumentationBindings.cpp
>>>               $WORK/b048/_x018.o:(LLVMAddDataFlowSanitizerPass)

ld.lld: error: undefined symbol: std::__cxx11::basic_string<char, std::char_traits<char>, std::allocator<char> >::~basic_string()
>>> referenced by InstrumentationBindings.cpp
>>>               $WORK/b048/_x018.o:(LLVMAddDataFlowSanitizerPass)

ld.lld: error: undefined symbol: std::allocator<char>::~allocator()
>>> referenced by InstrumentationBindings.cpp
>>>               $WORK/b048/_x018.o:(LLVMAddDataFlowSanitizerPass)

ld.lld: error: undefined symbol: std::__cxx11::basic_string<char, std::char_traits<char>, std::allocator<char> >::~basic_string()
>>> referenced by InstrumentationBindings.cpp
>>>               $WORK/b048/_x018.o:(LLVMAddDataFlowSanitizerPass)

ld.lld: error: undefined symbol: std::allocator<char>::~allocator()
>>> referenced by InstrumentationBindings.cpp
>>>               $WORK/b048/_x018.o:(LLVMAddDataFlowSanitizerPass)

ld.lld: error: undefined symbol: llvm::createDataFlowSanitizerPass(std::vector<std::__cxx11::basic_string<char, std::char_traits<char>, std::allocator<char> >, std::allocator<std::__cxx11::basic_string<char, std::char_traits<char>, std::allocator<char> > > > const&, void* (*)(), void* (*)())
>>> referenced by InstrumentationBindings.cpp
>>>               $WORK/b048/_x018.o:(LLVMAddDataFlowSanitizerPass)

ld.lld: error: undefined symbol: std::__cxx11::basic_string<char, std::char_traits<char>, std::allocator<char> >::~basic_string()
>>> referenced by InstrumentationBindings.cpp
>>>               $WORK/b048/_x018.o:(void std::_Destroy<std::__cxx11::basic_string<char, std::char_traits<char>, std::allocator<char> > >(std::__cxx11::basic_string<char, std::char_traits<char>, std::allocator<char> >*))

ld.lld: error: undefined symbol: std::__cxx11::basic_string<char, std::char_traits<char>, std::allocator<char> >::basic_string(std::__cxx11::basic_string<char, std::char_traits<char>, std::allocator<char> >&&)
>>> referenced by InstrumentationBindings.cpp
>>>               $WORK/b048/_x018.o:(void __gnu_cxx::new_allocator<std::__cxx11::basic_string<char, std::char_traits<char>, std::allocator<char> > >::construct<std::__cxx11::basic_string<char, std::char_traits<char>, std::allocator<char> >, std::__cxx11::basic_string<char, std::char_traits<char>, std::allocator<char> > >(std::__cxx11::basic_string<char, std::char_traits<char>, std::allocator<char> >*, std::__cxx11::basic_string<char, std::char_traits<char>, std::allocator<char> >&&))

ld.lld: error: undefined symbol: std::__throw_length_error(char const*)
>>> referenced by InstrumentationBindings.cpp
>>>               $WORK/b048/_x018.o:(std::vector<std::__cxx11::basic_string<char, std::char_traits<char>, std::allocator<char> >, std::allocator<std::__cxx11::basic_string<char, std::char_traits<char>, std::allocator<char> > > >::_M_check_len(unsigned long, char const*) const)

ld.lld: error: undefined symbol: std::__cxx11::basic_string<char, std::char_traits<char>, std::allocator<char> >::basic_string(std::__cxx11::basic_string<char, std::char_traits<char>, std::allocator<char> >&&)
>>> referenced by InstrumentationBindings.cpp
>>>               $WORK/b048/_x018.o:(void std::_Construct<std::__cxx11::basic_string<char, std::char_traits<char>, std::allocator<char> >, std::__cxx11::basic_string<char, std::char_traits<char>, std::allocator<char> > >(std::__cxx11::basic_string<char, std::char_traits<char>, std::allocator<char> >*, std::__cxx11::basic_string<char, std::char_traits<char>, std::allocator<char> >&&))

ld.lld: error: undefined symbol: std::__cxx11::basic_string<char, std::char_traits<char>, std::allocator<char> >::~basic_string()
>>> referenced by InstrumentationBindings.cpp
>>>               $WORK/b048/_x018.o:(void __gnu_cxx::new_allocator<std::__cxx11::basic_string<char, std::char_traits<char>, std::allocator<char> > >::destroy<std::__cxx11::basic_string<char, std::char_traits<char>, std::allocator<char> > >(std::__cxx11::basic_string<char, std::char_traits<char>, std::allocator<char> >*))

ld.lld: error: undefined symbol: std::__cxx11::basic_string<char, std::char_traits<char>, std::allocator<char> >::basic_string()
>>> referenced by SupportBindings.cpp
>>>               $WORK/b048/_x019.o:(LLVMLoadLibraryPermanently2)

ld.lld: error: undefined symbol: std::__cxx11::basic_string<char, std::char_traits<char>, std::allocator<char> >::size() const
>>> referenced by SupportBindings.cpp
>>>               $WORK/b048/_x019.o:(LLVMLoadLibraryPermanently2)

ld.lld: error: undefined symbol: std::__cxx11::basic_string<char, std::char_traits<char>, std::allocator<char> >::c_str() const
>>> referenced by SupportBindings.cpp
>>>               $WORK/b048/_x019.o:(LLVMLoadLibraryPermanently2)

ld.lld: error: undefined symbol: std::__cxx11::basic_string<char, std::char_traits<char>, std::allocator<char> >::size() const
>>> referenced by SupportBindings.cpp
>>>               $WORK/b048/_x019.o:(LLVMLoadLibraryPermanently2)

ld.lld: error: undefined symbol: std::__cxx11::basic_string<char, std::char_traits<char>, std::allocator<char> >::~basic_string()
>>> referenced by SupportBindings.cpp
>>>               $WORK/b048/_x019.o:(LLVMLoadLibraryPermanently2)

ld.lld: error: undefined symbol: std::__cxx11::basic_string<char, std::char_traits<char>, std::allocator<char> >::~basic_string()
>>> referenced by SupportBindings.cpp
>>>               $WORK/b048/_x019.o:(LLVMLoadLibraryPermanently2)

ld.lld: error: undefined symbol: llvm::sys::DynamicLibrary::getPermanentLibrary(char const*, std::__cxx11::basic_string<char, std::char_traits<char>, std::allocator<char> >*)
>>> referenced by SupportBindings.cpp
>>>               $WORK/b048/_x019.o:(llvm::sys::DynamicLibrary::LoadLibraryPermanently(char const*, std::__cxx11::basic_string<char, std::char_traits<char>, std::allocator<char> >*))

ld.lld: error: undefined symbol: __asan_option_detect_stack_use_after_return
>>> referenced by MCJIT.cpp:45 (/usr/local/google/home/mitchp/llvm/llvm/lib/ExecutionEngine/MCJIT/MCJIT.cpp:45)
>>>               MCJIT.cpp.o:(llvm::MCJIT::createJIT(std::__1::unique_ptr<llvm::Module, std::__1::default_delete<llvm::Module> >, std::__1::basic_string<char, std::__1::char_traits<char>, std::__1::allocator<char> >*, std::__1::shared_ptr<llvm::MCJITMemoryManager>, std::__1::shared_ptr<llvm::LegacyJITSymbolResolver>, std::__1::unique_ptr<llvm::TargetMachine, std::__1::default_delete<llvm::TargetMachine> >)) in archive /usr/local/google/home/mitchp/llvm-build/asan/sanitized-clang/lib/libLLVMMCJIT.a

ld.lld: error: too many errors emitted, stopping now (use -error-limit=0 to see all errors)
clang-9: error: linker command failed with exit code 1 (use -v to see invocation)

--

Details

Committed
hctimMar 8 2019, 2:34 PM
Parents
rL355748: [LLD] Fixed flaky unit test based on build directory.
Branches
Unknown
Tags
Unknown