Page MenuHomePhabricator
Paste P7982

libc++abi mingw gcc
ActivePublic

Authored by mati865 on Apr 3 2017, 6:14 AM.
Scanning dependencies of target cxx_objects
Scanning dependencies of target cxxabi_objects
[ 0%] Building CXX object projects/libcxxabi/src/CMakeFiles/cxxabi_objects.dir/cxa_aux_runtime.cpp.obj
[ 0%] Building CXX object projects/libcxxabi/src/CMakeFiles/cxxabi_objects.dir/cxa_default_handlers.cpp.obj
[ 0%] Building CXX object projects/libcxx/lib/CMakeFiles/cxx_objects.dir/__/src/algorithm.cpp.obj
[ 0%] Building CXX object projects/libcxxabi/src/CMakeFiles/cxxabi_objects.dir/cxa_demangle.cpp.obj
[ 0%] Building CXX object projects/libcxxabi/src/CMakeFiles/cxxabi_objects.dir/cxa_exception_storage.cpp.obj
[ 0%] Building CXX object projects/libcxx/lib/CMakeFiles/cxx_objects.dir/__/src/any.cpp.obj
[ 0%] Building CXX object projects/libcxx/lib/CMakeFiles/cxx_objects.dir/__/src/bind.cpp.obj
[ 0%] Building CXX object projects/libcxx/lib/CMakeFiles/cxx_objects.dir/__/src/chrono.cpp.obj
[ 0%] Building CXX object projects/libcxxabi/src/CMakeFiles/cxxabi_objects.dir/cxa_guard.cpp.obj
[ 0%] Building CXX object projects/libcxxabi/src/CMakeFiles/cxxabi_objects.dir/cxa_handlers.cpp.obj
[ 0%] Building CXX object projects/libcxx/lib/CMakeFiles/cxx_objects.dir/__/src/condition_variable.cpp.obj
[ 0%] Building CXX object projects/libcxxabi/src/CMakeFiles/cxxabi_objects.dir/cxa_unexpected.cpp.obj
[ 0%] Building CXX object projects/libcxx/lib/CMakeFiles/cxx_objects.dir/__/src/debug.cpp.obj
D:/projekty/msys2/MINGW-packages/mingw-w64-libc++-git/src/llvm/projects/libcxxabi/src/cxa_handlers.cpp: In function 'void std::unexpected()':
D:/projekty/msys2/MINGW-packages/mingw-w64-libc++-git/src/llvm/projects/libcxxabi/src/cxa_handlers.cpp:44:1: warning: 'void std::unexpected()' redeclared without dllimport attribute: previous dllimport ignored [-Wattributes]
unexpected()
^~~~~~~~~~
[ 0%] Building CXX object projects/libcxxabi/src/CMakeFiles/cxxabi_objects.dir/cxa_vector.cpp.obj
[ 0%] Building CXX object projects/libcxxabi/src/CMakeFiles/cxxabi_objects.dir/cxa_virtual.cpp.obj
[ 0%] Building CXX object projects/libcxx/lib/CMakeFiles/cxx_objects.dir/__/src/exception.cpp.obj
[ 0%] Building CXX object projects/libcxxabi/src/CMakeFiles/cxxabi_objects.dir/stdlib_exception.cpp.obj
In file included from D:/projekty/msys2/MINGW-packages/mingw-w64-libc++-git/src/llvm/projects/libcxx/src/exception.cpp:16:0:
D:/projekty/msys2/MINGW-packages/mingw-w64-libc++-git/src/build-x86_64-w64-mingw32/projects/libcxx/include/c++build/cxxabi.h:30:27: warning: type attributes ignored after type is already defined [-Wattributes]
class _LIBCXXABI_TYPE_VIS type_info; // forward declaration
^~~~~~~~~
[ 0%] Building CXX object projects/libcxxabi/src/CMakeFiles/cxxabi_objects.dir/stdlib_stdexcept.cpp.obj
[ 0%] Building CXX object projects/libcxx/lib/CMakeFiles/cxx_objects.dir/__/src/functional.cpp.obj
[ 0%] Building CXX object projects/libcxxabi/src/CMakeFiles/cxxabi_objects.dir/stdlib_typeinfo.cpp.obj
D:/projekty/msys2/MINGW-packages/mingw-w64-libc++-git/src/llvm/projects/libcxxabi/src/stdlib_typeinfo.cpp:17:1: warning: 'virtual std::type_info::~type_info()' redeclared without dllimport attribute: previous dllimport ignored [-Wattributes]
type_info::~type_info()
^~~~~~~~~
[ 0%] Building CXX object projects/libcxxabi/src/CMakeFiles/cxxabi_objects.dir/abort_message.cpp.obj
[ 0%] Building CXX object projects/libcxx/lib/CMakeFiles/cxx_objects.dir/__/src/future.cpp.obj
[ 0%] Building CXX object projects/libcxxabi/src/CMakeFiles/cxxabi_objects.dir/fallback_malloc.cpp.obj
D:/projekty/msys2/MINGW-packages/mingw-w64-libc++-git/src/llvm/projects/libcxxabi/src/fallback_malloc.cpp:68:34: warning: dereferencing type-punned pointer will break strict-aliasing rules [-Wstrict-aliasing]
(heap_node*)(&heap[HEAP_SIZE]); // one past the end of the heap
^
D:/projekty/msys2/MINGW-packages/mingw-w64-libc++-git/src/llvm/projects/libcxxabi/src/fallback_malloc.cpp: In function 'void {anonymous}::init_heap()':
D:/projekty/msys2/MINGW-packages/mingw-w64-libc++-git/src/llvm/projects/libcxxabi/src/fallback_malloc.cpp:82:26: warning: dereferencing type-punned pointer will break strict-aliasing rules [-Wstrict-aliasing]
freelist = (heap_node*)heap;
^~~~
[ 0%] Building CXX object projects/libcxxabi/src/CMakeFiles/cxxabi_objects.dir/private_typeinfo.cpp.obj
[ 0%] Building CXX object projects/libcxxabi/src/CMakeFiles/cxxabi_objects.dir/stdlib_new_delete.cpp.obj
D:/projekty/msys2/MINGW-packages/mingw-w64-libc++-git/src/llvm/projects/libcxxabi/src/private_typeinfo.cpp: In function 'bool is_equal(const std::type_info*, const std::type_info*, bool)':
D:/projekty/msys2/MINGW-packages/mingw-w64-libc++-git/src/llvm/projects/libcxxabi/src/private_typeinfo.cpp:60:65: warning: unused parameter 'use_strcmp' [-Wunused-parameter]
is_equal(const std::type_info* x, const std::type_info* y, bool use_strcmp)
^~~~~~~~~~
[ 0%] Building CXX object projects/libcxx/lib/CMakeFiles/cxx_objects.dir/__/src/hash.cpp.obj
[ 0%] Building CXX object projects/libcxxabi/src/CMakeFiles/cxxabi_objects.dir/cxa_exception.cpp.obj
[ 0%] Building CXX object projects/libcxxabi/src/CMakeFiles/cxxabi_objects.dir/cxa_personality.cpp.obj
In file included from D:/projekty/msys2/MINGW-packages/mingw-w64-libc++-git/src/llvm/projects/libcxxabi/src/cxa_exception.hpp:18:0,
from D:/projekty/msys2/MINGW-packages/mingw-w64-libc++-git/src/llvm/projects/libcxxabi/src/cxa_personality.cpp:21:
D:/projekty/msys2/MINGW-packages/mingw-w64-libc++-git/src/llvm/projects/libcxxabi/include/cxxabi.h:30:27: warning: type attributes ignored after type is already defined [-Wattributes]
class _LIBCXXABI_TYPE_VIS type_info; // forward declaration
^~~~~~~~~
[ 0%] Building CXX object projects/libcxx/lib/CMakeFiles/cxx_objects.dir/__/src/ios.cpp.obj
In file included from D:/projekty/msys2/MINGW-packages/mingw-w64-libc++-git/src/llvm/projects/libcxx/src/ios.cpp:18:0:
D:/projekty/msys2/MINGW-packages/mingw-w64-libc++-git/src/llvm/projects/libcxx/src/include/config_elast.h:37:2: warning: #warning ELAST for this platform not yet implemented [-Wcpp]
#warning ELAST for this platform not yet implemented
^~~~~~~
[ 0%] Building CXX object projects/libcxx/lib/CMakeFiles/cxx_objects.dir/__/src/iostream.cpp.obj
[ 0%] Built target cxxabi_objects
Scanning dependencies of target cxxabi_shared
[ 0%] Linking CXX shared library ../../../bin/libc++abi.dll
CMakeFiles/cxxabi_shared.dir/objects.a(cxa_aux_runtime.cpp.obj):cxa_aux_runtime.cpp:(.text+0x17): undefined reference to `__imp__ZNSt8bad_castC1Ev'
CMakeFiles/cxxabi_shared.dir/objects.a(cxa_aux_runtime.cpp.obj):cxa_aux_runtime.cpp:(.text+0x1e): undefined reference to `__imp__ZNSt8bad_castD1Ev'
CMakeFiles/cxxabi_shared.dir/objects.a(cxa_aux_runtime.cpp.obj):cxa_aux_runtime.cpp:(.text+0x57): undefined reference to `__imp__ZNSt10bad_typeidC1Ev'
CMakeFiles/cxxabi_shared.dir/objects.a(cxa_aux_runtime.cpp.obj):cxa_aux_runtime.cpp:(.text+0x5e): undefined reference to `__imp__ZNSt10bad_typeidD1Ev'
CMakeFiles/cxxabi_shared.dir/objects.a(cxa_aux_runtime.cpp.obj):cxa_aux_runtime.cpp:(.text+0x97): undefined reference to `__imp__ZNSt20bad_array_new_lengthC1Ev'
CMakeFiles/cxxabi_shared.dir/objects.a(cxa_aux_runtime.cpp.obj):cxa_aux_runtime.cpp:(.text+0x9e): undefined reference to `__imp__ZNSt20bad_array_new_lengthD1Ev'
CMakeFiles/cxxabi_shared.dir/objects.a(cxa_default_handlers.cpp.obj):cxa_default_handlers.cpp:(.text+0x14): undefined reference to `__imp__ZSt9terminatev'
CMakeFiles/cxxabi_shared.dir/objects.a(cxa_vector.cpp.obj):cxa_vector.cpp:(.text+0x3e): undefined reference to `__imp__ZSt9terminatev'
CMakeFiles/cxxabi_shared.dir/objects.a(cxa_vector.cpp.obj):cxa_vector.cpp:(.text+0x3a9): undefined reference to `__imp__ZSt9terminatev'
CMakeFiles/cxxabi_shared.dir/objects.a(stdlib_stdexcept.cpp.obj):stdlib_stdexcept.cpp:(.text+0x28): undefined reference to `__imp__ZTVSt11logic_error'
CMakeFiles/cxxabi_shared.dir/objects.a(stdlib_stdexcept.cpp.obj):stdlib_stdexcept.cpp:(.text+0x54): undefined reference to `__imp__ZNSt9exceptionD2Ev'
CMakeFiles/cxxabi_shared.dir/objects.a(stdlib_stdexcept.cpp.obj):stdlib_stdexcept.cpp:(.text+0x74): undefined reference to `__imp__ZNSt9exceptionD2Ev'
CMakeFiles/cxxabi_shared.dir/objects.a(stdlib_stdexcept.cpp.obj):stdlib_stdexcept.cpp:(.text+0x88): undefined reference to `__imp__ZTVSt13runtime_error'
CMakeFiles/cxxabi_shared.dir/objects.a(stdlib_stdexcept.cpp.obj):stdlib_stdexcept.cpp:(.text+0xb4): undefined reference to `__imp__ZNSt9exceptionD2Ev'
CMakeFiles/cxxabi_shared.dir/objects.a(stdlib_stdexcept.cpp.obj):stdlib_stdexcept.cpp:(.text+0xd4): undefined reference to `__imp__ZNSt9exceptionD2Ev'
CMakeFiles/cxxabi_shared.dir/objects.a(stdlib_stdexcept.cpp.obj):stdlib_stdexcept.cpp:(.text+0xe8): undefined reference to `__imp__ZTVSt11logic_error'
CMakeFiles/cxxabi_shared.dir/objects.a(stdlib_stdexcept.cpp.obj):stdlib_stdexcept.cpp:(.text+0x10e): undefined reference to `__imp__ZNSt9exceptionD2Ev'
CMakeFiles/cxxabi_shared.dir/objects.a(stdlib_stdexcept.cpp.obj):stdlib_stdexcept.cpp:(.text+0x138): undefined reference to `__imp__ZTVSt13runtime_error'
CMakeFiles/cxxabi_shared.dir/objects.a(stdlib_stdexcept.cpp.obj):stdlib_stdexcept.cpp:(.text+0x15e): undefined reference to `__imp__ZNSt9exceptionD2Ev'
CMakeFiles/cxxabi_shared.dir/objects.a(stdlib_stdexcept.cpp.obj):stdlib_stdexcept.cpp:(.text+0x188): undefined reference to `__imp__ZTVSt11logic_error'
CMakeFiles/cxxabi_shared.dir/objects.a(stdlib_stdexcept.cpp.obj):stdlib_stdexcept.cpp:(.text+0x1b4): undefined reference to `__imp__ZNSt9exceptionD2Ev'
CMakeFiles/cxxabi_shared.dir/objects.a(stdlib_stdexcept.cpp.obj):stdlib_stdexcept.cpp:(.text+0x1d4): undefined reference to `__imp__ZNSt9exceptionD2Ev'
CMakeFiles/cxxabi_shared.dir/objects.a(stdlib_stdexcept.cpp.obj):stdlib_stdexcept.cpp:(.text+0x1e8): undefined reference to `__imp__ZTVSt11logic_error'
CMakeFiles/cxxabi_shared.dir/objects.a(stdlib_stdexcept.cpp.obj):stdlib_stdexcept.cpp:(.text+0x20e): undefined reference to `__imp__ZNSt9exceptionD2Ev'
CMakeFiles/cxxabi_shared.dir/objects.a(stdlib_stdexcept.cpp.obj):stdlib_stdexcept.cpp:(.text+0x238): undefined reference to `__imp__ZTVSt11logic_error'
CMakeFiles/cxxabi_shared.dir/objects.a(stdlib_stdexcept.cpp.obj):stdlib_stdexcept.cpp:(.text+0x264): undefined reference to `__imp__ZNSt9exceptionD2Ev'
CMakeFiles/cxxabi_shared.dir/objects.a(stdlib_stdexcept.cpp.obj):stdlib_stdexcept.cpp:(.text+0x284): undefined reference to `__imp__ZNSt9exceptionD2Ev'
CMakeFiles/cxxabi_shared.dir/objects.a(stdlib_stdexcept.cpp.obj):stdlib_stdexcept.cpp:(.text+0x298): undefined reference to `__imp__ZTVSt11logic_error'
CMakeFiles/cxxabi_shared.dir/objects.a(stdlib_stdexcept.cpp.obj):stdlib_stdexcept.cpp:(.text+0x2be): undefined reference to `__imp__ZNSt9exceptionD2Ev'
CMakeFiles/cxxabi_shared.dir/objects.a(stdlib_stdexcept.cpp.obj):stdlib_stdexcept.cpp:(.text+0x2e8): undefined reference to `__imp__ZTVSt11logic_error'
CMakeFiles/cxxabi_shared.dir/objects.a(stdlib_stdexcept.cpp.obj):stdlib_stdexcept.cpp:(.text+0x314): undefined reference to `__imp__ZNSt9exceptionD2Ev'
CMakeFiles/cxxabi_shared.dir/objects.a(stdlib_stdexcept.cpp.obj):stdlib_stdexcept.cpp:(.text+0x334): undefined reference to `__imp__ZNSt9exceptionD2Ev'
CMakeFiles/cxxabi_shared.dir/objects.a(stdlib_stdexcept.cpp.obj):stdlib_stdexcept.cpp:(.text+0x348): undefined reference to `__imp__ZTVSt11logic_error'
CMakeFiles/cxxabi_shared.dir/objects.a(stdlib_stdexcept.cpp.obj):stdlib_stdexcept.cpp:(.text+0x36e): undefined reference to `__imp__ZNSt9exceptionD2Ev'
CMakeFiles/cxxabi_shared.dir/objects.a(stdlib_stdexcept.cpp.obj):stdlib_stdexcept.cpp:(.text+0x398): undefined reference to `__imp__ZTVSt11logic_error'
CMakeFiles/cxxabi_shared.dir/objects.a(stdlib_stdexcept.cpp.obj):stdlib_stdexcept.cpp:(.text+0x3c4): undefined reference to `__imp__ZNSt9exceptionD2Ev'
CMakeFiles/cxxabi_shared.dir/objects.a(stdlib_stdexcept.cpp.obj):stdlib_stdexcept.cpp:(.text+0x3e4): undefined reference to `__imp__ZNSt9exceptionD2Ev'
CMakeFiles/cxxabi_shared.dir/objects.a(stdlib_stdexcept.cpp.obj):stdlib_stdexcept.cpp:(.text+0x3f8): undefined reference to `__imp__ZTVSt11logic_error'
CMakeFiles/cxxabi_shared.dir/objects.a(stdlib_stdexcept.cpp.obj):stdlib_stdexcept.cpp:(.text+0x41e): undefined reference to `__imp__ZNSt9exceptionD2Ev'
CMakeFiles/cxxabi_shared.dir/objects.a(stdlib_stdexcept.cpp.obj):stdlib_stdexcept.cpp:(.text+0x448): undefined reference to `__imp__ZTVSt13runtime_error'
CMakeFiles/cxxabi_shared.dir/objects.a(stdlib_stdexcept.cpp.obj):stdlib_stdexcept.cpp:(.text+0x474): undefined reference to `__imp__ZNSt9exceptionD2Ev'
CMakeFiles/cxxabi_shared.dir/objects.a(stdlib_stdexcept.cpp.obj):stdlib_stdexcept.cpp:(.text+0x494): undefined reference to `__imp__ZNSt9exceptionD2Ev'
CMakeFiles/cxxabi_shared.dir/objects.a(stdlib_stdexcept.cpp.obj):stdlib_stdexcept.cpp:(.text+0x4a8): undefined reference to `__imp__ZTVSt13runtime_error'
CMakeFiles/cxxabi_shared.dir/objects.a(stdlib_stdexcept.cpp.obj):stdlib_stdexcept.cpp:(.text+0x4ce): undefined reference to `__imp__ZNSt9exceptionD2Ev'
CMakeFiles/cxxabi_shared.dir/objects.a(stdlib_stdexcept.cpp.obj):stdlib_stdexcept.cpp:(.text+0x4f8): undefined reference to `__imp__ZTVSt13runtime_error'
CMakeFiles/cxxabi_shared.dir/objects.a(stdlib_stdexcept.cpp.obj):stdlib_stdexcept.cpp:(.text+0x524): undefined reference to `__imp__ZNSt9exceptionD2Ev'
CMakeFiles/cxxabi_shared.dir/objects.a(stdlib_stdexcept.cpp.obj):stdlib_stdexcept.cpp:(.text+0x544): undefined reference to `__imp__ZNSt9exceptionD2Ev'
CMakeFiles/cxxabi_shared.dir/objects.a(stdlib_stdexcept.cpp.obj):stdlib_stdexcept.cpp:(.text+0x558): undefined reference to `__imp__ZTVSt13runtime_error'
CMakeFiles/cxxabi_shared.dir/objects.a(stdlib_stdexcept.cpp.obj):stdlib_stdexcept.cpp:(.text+0x57e): undefined reference to `__imp__ZNSt9exceptionD2Ev'
CMakeFiles/cxxabi_shared.dir/objects.a(stdlib_stdexcept.cpp.obj):stdlib_stdexcept.cpp:(.text+0x5a8): undefined reference to `__imp__ZTVSt13runtime_error'
CMakeFiles/cxxabi_shared.dir/objects.a(stdlib_stdexcept.cpp.obj):stdlib_stdexcept.cpp:(.text+0x5d4): undefined reference to `__imp__ZNSt9exceptionD2Ev'
CMakeFiles/cxxabi_shared.dir/objects.a(stdlib_stdexcept.cpp.obj):stdlib_stdexcept.cpp:(.text+0x5f4): undefined reference to `__imp__ZNSt9exceptionD2Ev'
CMakeFiles/cxxabi_shared.dir/objects.a(stdlib_stdexcept.cpp.obj):stdlib_stdexcept.cpp:(.text+0x608): undefined reference to `__imp__ZTVSt13runtime_error'
CMakeFiles/cxxabi_shared.dir/objects.a(stdlib_stdexcept.cpp.obj):stdlib_stdexcept.cpp:(.text+0x62e): undefined reference to `__imp__ZNSt9exceptionD2Ev'
CMakeFiles/cxxabi_shared.dir/objects.a(stdlib_typeinfo.cpp.obj):stdlib_typeinfo.cpp:(.text+0x23): undefined reference to `__imp__ZTVSt8bad_cast'
CMakeFiles/cxxabi_shared.dir/objects.a(stdlib_typeinfo.cpp.obj):stdlib_typeinfo.cpp:(.text+0x31): undefined reference to `__imp__ZNSt9exceptionD2Ev'
CMakeFiles/cxxabi_shared.dir/objects.a(stdlib_typeinfo.cpp.obj):stdlib_typeinfo.cpp:(.text+0x48): undefined reference to `__imp__ZTVSt8bad_cast'
CMakeFiles/cxxabi_shared.dir/objects.a(stdlib_typeinfo.cpp.obj):stdlib_typeinfo.cpp:(.text+0x58): undefined reference to `__imp__ZNSt9exceptionD2Ev'
CMakeFiles/cxxabi_shared.dir/objects.a(stdlib_typeinfo.cpp.obj):stdlib_typeinfo.cpp:(.text+0x73): undefined reference to `__imp__ZTVSt10bad_typeid'
CMakeFiles/cxxabi_shared.dir/objects.a(stdlib_typeinfo.cpp.obj):stdlib_typeinfo.cpp:(.text+0x81): undefined reference to `__imp__ZNSt9exceptionD2Ev'
CMakeFiles/cxxabi_shared.dir/objects.a(stdlib_typeinfo.cpp.obj):stdlib_typeinfo.cpp:(.text+0x98): undefined reference to `__imp__ZTVSt10bad_typeid'
CMakeFiles/cxxabi_shared.dir/objects.a(stdlib_typeinfo.cpp.obj):stdlib_typeinfo.cpp:(.text+0xa8): undefined reference to `__imp__ZNSt9exceptionD2Ev'
CMakeFiles/cxxabi_shared.dir/objects.a(stdlib_typeinfo.cpp.obj):stdlib_typeinfo.cpp:(.text+0xe3): undefined reference to `__imp__ZTVSt8bad_cast'
CMakeFiles/cxxabi_shared.dir/objects.a(stdlib_typeinfo.cpp.obj):stdlib_typeinfo.cpp:(.text+0xf3): undefined reference to `__imp__ZTVSt10bad_typeid'
CMakeFiles/cxxabi_shared.dir/objects.a(private_typeinfo.cpp.obj):private_typeinfo.cpp:(.text+0x2d): undefined reference to `__imp__ZNSt9type_infoD2Ev'
CMakeFiles/cxxabi_shared.dir/objects.a(private_typeinfo.cpp.obj):private_typeinfo.cpp:(.text+0x4d): undefined reference to `__imp__ZNSt9type_infoD2Ev'
CMakeFiles/cxxabi_shared.dir/objects.a(private_typeinfo.cpp.obj):private_typeinfo.cpp:(.text+0x6d): undefined reference to `__imp__ZNSt9type_infoD2Ev'
CMakeFiles/cxxabi_shared.dir/objects.a(private_typeinfo.cpp.obj):private_typeinfo.cpp:(.text+0x8d): undefined reference to `__imp__ZNSt9type_infoD2Ev'
CMakeFiles/cxxabi_shared.dir/objects.a(private_typeinfo.cpp.obj):private_typeinfo.cpp:(.text+0xad): undefined reference to `__imp__ZNSt9type_infoD2Ev'
CMakeFiles/cxxabi_shared.dir/objects.a(private_typeinfo.cpp.obj):private_typeinfo.cpp:(.text+0xcd): more undefined references to `__imp__ZNSt9type_infoD2Ev' follow
CMakeFiles/cxxabi_shared.dir/objects.a(cxa_exception.cpp.obj):cxa_exception.cpp:(.text+0x3e): undefined reference to `__imp__ZSt9terminatev'
CMakeFiles/cxxabi_shared.dir/objects.a(cxa_exception.cpp.obj):cxa_exception.cpp:(.text+0xe0): undefined reference to `__imp__ZSt9terminatev'
CMakeFiles/cxxabi_shared.dir/objects.a(cxa_exception.cpp.obj):cxa_exception.cpp:(.text+0x18d): undefined reference to `__imp__ZSt9terminatev'
CMakeFiles/cxxabi_shared.dir/objects.a(cxa_exception.cpp.obj):cxa_exception.cpp:(.text+0x1cb): undefined reference to `__imp__ZSt14get_unexpectedv'
CMakeFiles/cxxabi_shared.dir/objects.a(cxa_exception.cpp.obj):cxa_exception.cpp:(.text+0x1d8): undefined reference to `__imp__ZSt13get_terminatev'
CMakeFiles/cxxabi_shared.dir/objects.a(cxa_exception.cpp.obj):cxa_exception.cpp:(.text+0x2c5): undefined reference to `__imp__ZSt9terminatev'
CMakeFiles/cxxabi_shared.dir/objects.a(cxa_exception.cpp.obj):cxa_exception.cpp:(.text+0x4f1): undefined reference to `__imp__ZSt14get_unexpectedv'
CMakeFiles/cxxabi_shared.dir/objects.a(cxa_exception.cpp.obj):cxa_exception.cpp:(.text+0x4fb): undefined reference to `__imp__ZSt13get_terminatev'
CMakeFiles/cxxabi_shared.dir/objects.a(cxa_personality.cpp.obj):cxa_personality.cpp:(.text+0x23): undefined reference to `__imp__ZSt9terminatev'
CMakeFiles/cxxabi_shared.dir/objects.a(cxa_personality.cpp.obj):cxa_personality.cpp:(.text+0xaa4): undefined reference to `__imp__ZSt13get_terminatev'
CMakeFiles/cxxabi_shared.dir/objects.a(cxa_personality.cpp.obj):cxa_personality.cpp:(.text+0xaaf): undefined reference to `__imp__ZSt14get_unexpectedv'
CMakeFiles/cxxabi_shared.dir/objects.a(cxa_personality.cpp.obj):cxa_personality.cpp:(.text+0xbce): undefined reference to `__imp__ZTVSt13bad_exception'
CMakeFiles/cxxabi_shared.dir/objects.a(cxa_personality.cpp.obj):cxa_personality.cpp:(.text+0xbf4): undefined reference to `__imp__ZNSt13bad_exceptionD1Ev'
CMakeFiles/cxxabi_shared.dir/objects.a(cxa_personality.cpp.obj):cxa_personality.cpp:(.text+0xc0d): undefined reference to `__imp__ZNSt13bad_exceptionD1Ev'
CMakeFiles/cxxabi_shared.dir/objects.a(cxa_personality.cpp.obj):cxa_personality.cpp:(.text+0xc27): undefined reference to `__imp__ZNSt13bad_exceptionD1Ev'
CMakeFiles/cxxabi_shared.dir/objects.a(cxa_personality.cpp.obj):cxa_personality.cpp:(.text+0xc75): undefined reference to `__imp__ZNSt13bad_exceptionD1Ev'
collect2.exe: error: ld returned 1 exit status
make[3]: *** [projects/libcxxabi/src/CMakeFiles/cxxabi_shared.dir/build.make:106: bin/libc++abi.dll] Błąd 1
make[2]: *** [CMakeFiles/Makefile2:13788: projects/libcxxabi/src/CMakeFiles/cxxabi_shared.dir/all] Błąd 2
make[2]: *** Oczekiwanie na niezakończone zadania....
[ 0%] Building CXX object projects/libcxx/lib/CMakeFiles/cxx_objects.dir/__/src/locale.cpp.obj
[ 0%] Building CXX object projects/libcxx/lib/CMakeFiles/cxx_objects.dir/__/src/memory.cpp.obj
[ 0%] Building CXX object projects/libcxx/lib/CMakeFiles/cxx_objects.dir/__/src/mutex.cpp.obj
[ 0%] Building CXX object projects/libcxx/lib/CMakeFiles/cxx_objects.dir/__/src/new.cpp.obj
[ 0%] Building CXX object projects/libcxx/lib/CMakeFiles/cxx_objects.dir/__/src/random.cpp.obj
[ 0%] Building CXX object projects/libcxx/lib/CMakeFiles/cxx_objects.dir/__/src/optional.cpp.obj
[ 0%] Building CXX object projects/libcxx/lib/CMakeFiles/cxx_objects.dir/__/src/regex.cpp.obj
[ 0%] Building CXX object projects/libcxx/lib/CMakeFiles/cxx_objects.dir/__/src/shared_mutex.cpp.obj
[ 0%] Building CXX object projects/libcxx/lib/CMakeFiles/cxx_objects.dir/__/src/stdexcept.cpp.obj
[ 0%] Building CXX object projects/libcxx/lib/CMakeFiles/cxx_objects.dir/__/src/string.cpp.obj
In file included from D:/projekty/msys2/MINGW-packages/mingw-w64-libc++-git/src/llvm/projects/libcxx/src/stdexcept.cpp:19:0:
D:/projekty/msys2/MINGW-packages/mingw-w64-libc++-git/src/build-x86_64-w64-mingw32/projects/libcxx/include/c++build/cxxabi.h:30:27: warning: type attributes ignored after type is already defined [-Wattributes]
class _LIBCXXABI_TYPE_VIS type_info; // forward declaration
^~~~~~~~~
[ 0%] Building CXX object projects/libcxx/lib/CMakeFiles/cxx_objects.dir/__/src/strstream.cpp.obj
[ 0%] Building CXX object projects/libcxx/lib/CMakeFiles/cxx_objects.dir/__/src/system_error.cpp.obj
In file included from D:/projekty/msys2/MINGW-packages/mingw-w64-libc++-git/src/llvm/projects/libcxx/src/system_error.cpp:15:0:
D:/projekty/msys2/MINGW-packages/mingw-w64-libc++-git/src/llvm/projects/libcxx/src/include/config_elast.h:37:2: warning: #warning ELAST for this platform not yet implemented [-Wcpp]
#warning ELAST for this platform not yet implemented
^~~~~~~
[ 0%] Building CXX object projects/libcxx/lib/CMakeFiles/cxx_objects.dir/__/src/thread.cpp.obj
[ 0%] Building CXX object projects/libcxx/lib/CMakeFiles/cxx_objects.dir/__/src/typeinfo.cpp.obj
[ 0%] Building CXX object projects/libcxx/lib/CMakeFiles/cxx_objects.dir/__/src/utility.cpp.obj
[ 0%] Building CXX object projects/libcxx/lib/CMakeFiles/cxx_objects.dir/__/src/valarray.cpp.obj
[100%] Building CXX object projects/libcxx/lib/CMakeFiles/cxx_objects.dir/__/src/variant.cpp.obj
[100%] Building CXX object projects/libcxx/lib/CMakeFiles/cxx_objects.dir/__/src/support/win32/locale_win32.cpp.obj
[100%] Building CXX object projects/libcxx/lib/CMakeFiles/cxx_objects.dir/__/src/support/win32/support.cpp.obj
[100%] Built target cxx_objects

Event Timeline

mati865 created this paste.Apr 3 2017, 6:14 AM
mati865 created this object with visibility "Public (No Login Required)".
mati865 created this object with edit policy "mati865 (Mateusz Mikuła)".