Page MenuHomePhabricator

(An Untitled Masterwork)
ActivePublic

Authored by Bigcheese on Nov 13 2012, 3:07 PM.
-- Testing: 46 tests, 8 threads --
Testing: 0 .. 10.. 20.. 30.
FAIL: lld :: elf/rodata.objtxt (17 of 46)
******************** TEST 'lld :: elf/rodata.objtxt' FAILED ********************
Script:
--
lld-core -reader ELF -writer ELF -o /home/mspencer/llvm-project/build/all/release/tools/lld/test/elf/Output/rodata.objtxt.tmp1 /mnt/host/llvm-project/lold/test/elf/Inputs/rodata-test.i386 | llvm-objdump -section-headers /home/mspencer/llvm-project/build/all/release/tools/lld/test/elf/Output/rodata.objtxt.tmp1 | FileCheck -check-prefix=i386 /mnt/host/llvm-project/lold/test/elf/rodata.objtxt
lld-core -arch hexagon -reader ELF -writer ELF -o /home/mspencer/llvm-project/build/all/release/tools/lld/test/elf/Output/rodata.objtxt.tmp2 /mnt/host/llvm-project/lold/test/elf/Inputs/rodata-test.hexagon | llvm-objdump -section-headers /home/mspencer/llvm-project/build/all/release/tools/lld/test/elf/Output/rodata.objtxt.tmp2 | FileCheck -check-prefix=hexagon /mnt/host/llvm-project/lold/test/elf/rodata.objtxt
--
Exit Code: 1
Command Output (stderr):
--
/mnt/host/llvm-project/lold/test/elf/rodata.objtxt:4:8: error: expected string not found in input
i386: 2 .rodata 000000004
^
<stdin>:2:1: note: scanning from here
/home/mspencer/llvm-project/build/all/release/tools/lld/test/elf/Output/rodata.objtxt.tmp1: file format ELF32-i386
^
<stdin>:7:2: note: possible intended match here
1 .rodata 000000004 00000000000000174 DATA
^
--
********************
Testing: 0 .. 10.. 20.. 30.. 40
FAIL: lld :: elf/sections.objtxt (20 of 46)
******************** TEST 'lld :: elf/sections.objtxt' FAILED ********************
Script:
--
lld-core -reader ELF -writer ELF -o /home/mspencer/llvm-project/build/all/release/tools/lld/test/elf/Output/sections.objtxt.tmp1 /mnt/host/llvm-project/lold/test/elf/Inputs/section-test.i386 | llvm-objdump -section-headers /home/mspencer/llvm-project/build/all/release/tools/lld/test/elf/Output/sections.objtxt.tmp1 | FileCheck -check-prefix=OBJDUMP /mnt/host/llvm-project/lold/test/elf/sections.objtxt
llvm-readobj /home/mspencer/llvm-project/build/all/release/tools/lld/test/elf/Output/sections.objtxt.tmp1 | FileCheck -check-prefix=READOBJ /mnt/host/llvm-project/lold/test/elf/sections.objtxt
elf-dump --dump-section /home/mspencer/llvm-project/build/all/release/tools/lld/test/elf/Output/sections.objtxt.tmp1 | FileCheck -check-prefix=ED /mnt/host/llvm-project/lold/test/elf/sections.objtxt
--
Exit Code: 1
Command Output (stderr):
--
/mnt/host/llvm-project/lold/test/elf/sections.objtxt:6:10: error: expected string not found in input
OBJDUMP: 1 .text 00000000a 00000000000400074 TEXT DATA
^
<stdin>:7:2: note: scanning from here
1 .anotherspecial 000000004 000000000000001a0 DATA
^
<stdin>:10:2: note: possible intended match here
4 .text 00000000a 000000000000001ac TEXT DATA
^
--
********************
Testing: 0 .. 10.. 20.. 30.. 40.. 50.. 60.. 70.. 80.. 90..
Testing Time: 1.13s
********************
Failing Tests (2):
lld :: elf/rodata.objtxt
lld :: elf/sections.objtxt
Expected Passes : 44
Unexpected Failures: 2

Event Timeline

Bigcheese edited the content of this paste. (Show Details)Nov 13 2012, 3:07 PM