HomePhabricator

Revert "[test] Default clang/test to FileCheck --allow-unused-prefixes=false"

Authored by thakis on Feb 2 2021, 4:38 AM.

Description

Revert "[test] Default clang/test to FileCheck --allow-unused-prefixes=false"

This reverts commit 80f539526eec31f03aadd96753648686312b1ad1.
Many test failures on mac: http://45.33.8.238/macm1/2772/summary.html
One on win: http://45.33.8.238/win/32442/summary.html

Event Timeline

MaskRay added a subscriber: MaskRay.EditedFeb 2 2021, 11:18 AM

Can you investigate why the test failed on aarch64 macOS ? It is puzzling:

/Users/thakis/src/llvm-project/clang/test/Driver/arc.c:11:11: error: CHECK: expected string not found in input
// CHECK: error: -fobjc-arc is not supported on platforms using the legacy runtime
          ^
<stdin>:1:1: note: scanning from here
/Users/thakis/src/llvm-project/clang/test/Driver/arc.c:9:3: error: invalid preprocessing directive
^
<stdin>:1:61: note: possible intended match here
/Users/thakis/src/llvm-project/clang/test/Driver/arc.c:9:3: error: invalid preprocessing directive

edit: My bad. Found the issue.

/clang/test/Driver/lit.local.cfg
9

My bad... I did not notice this block